FailedConsole Output

Started by an SCM change
Running as SYSTEM
[EnvInject] - Loading node environment variables.
Building in workspace /var/lib/jenkins/workspace/JustEnoughItems-MC1.12
No credentials specified
 > git rev-parse --is-inside-work-tree # timeout=10
Fetching changes from the remote Git repository
 > git config remote.origin.url https://github.com/mezz/JustEnoughItems.git # timeout=10
Fetching upstream changes from https://github.com/mezz/JustEnoughItems.git
 > git --version # timeout=10
 > git fetch --tags --progress https://github.com/mezz/JustEnoughItems.git +refs/heads/*:refs/remotes/origin/* # timeout=10
Seen branch in repository origin/1.10
Seen branch in repository origin/1.11
Seen branch in repository origin/1.12
Seen branch in repository origin/1.12-FG3
Seen branch in repository origin/1.12-wip
Seen branch in repository origin/1.13
Seen branch in repository origin/1.13-pre
Seen branch in repository origin/1.14
Seen branch in repository origin/1.15
Seen branch in repository origin/1.16
Seen branch in repository origin/1.8
Seen branch in repository origin/1.8.8
Seen branch in repository origin/1.8.9
Seen branch in repository origin/1.9
Seen branch in repository origin/async-plugins
Seen branch in repository origin/default-wrapper
Seen branch in repository origin/ingredient-list-refactor
Seen branch in repository origin/sorting
Seen branch in repository origin/subtype-interpreter
Seen branch in repository origin/test-gradle
Seen branch in repository origin/test-travis-ci
Seen branch in repository origin/travis-fg-3
Seen 22 remote branches
 > git show-ref --tags -d # timeout=10
Checking out Revision 4bde32ad9084bc67f85c4b195a901f156c0ba772 (origin/1.12)
 > git config core.sparsecheckout # timeout=10
 > git checkout -f 4bde32ad9084bc67f85c4b195a901f156c0ba772 # timeout=10
Commit message: "Add resources with Forge 1.12.2 and FG3 (#2015)"
 > git rev-list --no-walk 64dd48e817ccf3f901dcfbc777a256938005d34f # timeout=10
[EnvInject] - Executing scripts and injecting environment variables after the SCM step.
[EnvInject] - Mask passwords that will be passed as build parameters.
[JustEnoughItems-MC1.12] $ /bin/sh -xe /tmp/jenkins8974527796126706093.sh
+ rm -rf build/libs
[Gradle] - Launching build.
[JustEnoughItems-MC1.12] $ /var/lib/jenkins/workspace/JustEnoughItems-MC1.12/gradlew ******** -s -Plocal_maven=/var/www/dvs1/files/maven setupCIWorkspace test reobf uploadArchives curseforge
Downloading https://services.gradle.org/distributions/gradle-4.9-all.zip
............................................................................................................
Unzipping /var/lib/jenkins/workspace/JustEnoughItems-MC1.12/wrapper/dists/gradle-4.9-all/491wbe0x5d54n9cojs2p0zv90/gradle-4.9-all.zip to /var/lib/jenkins/workspace/JustEnoughItems-MC1.12/wrapper/dists/gradle-4.9-all/491wbe0x5d54n9cojs2p0zv90
Set executable permissions for: /var/lib/jenkins/workspace/JustEnoughItems-MC1.12/wrapper/dists/gradle-4.9-all/491wbe0x5d54n9cojs2p0zv90/gradle-4.9/bin/gradle

Welcome to Gradle 4.9!

Here are the highlights of this release:
 - Experimental APIs for creating and configuring tasks lazily
 - Pass arguments to JavaExec via CLI
 - Auxiliary publication dependency support for multi-project builds
 - Improved dependency insight report

For more details see https://docs.gradle.org/4.9/release-notes.html

Download https://plugins.gradle.org/m2/com/matthewprenger/cursegradle/com.matthewprenger.cursegradle.gradle.plugin/1.2.0/com.matthewprenger.cursegradle.gradle.plugin-1.2.0.pom
Download https://plugins.gradle.org/m2/se/bjurr/gitchangelog/git-changelog-gradle-plugin/se.bjurr.gitchangelog.git-changelog-gradle-plugin.gradle.plugin/1.64/se.bjurr.gitchangelog.git-changelog-gradle-plugin.gradle.plugin-1.64.pom
Download https://files.minecraftforge.net/maven/net/minecraftforge/gradle/ForgeGradle/maven-metadata.xml
Download https://files.minecraftforge.net/maven/net/minecraftforge/gradle/ForgeGradle/3.0.181/ForgeGradle-3.0.181.pom
Download https://files.minecraftforge.net/maven/net/minecraftforge/artifactural/maven-metadata.xml
Download https://files.minecraftforge.net/maven/net/minecraftforge/artifactural/1.0.12/artifactural-1.0.12.pom
Download https://jcenter.bintray.com/com/google/code/gson/gson/2.8.5/gson-2.8.5.pom
Download https://jcenter.bintray.com/com/cloudbees/diff4j/1.2/diff4j-1.2.pom
Download https://jcenter.bintray.com/com/google/code/gson/gson-parent/2.8.5/gson-parent-2.8.5.pom
Download https://jcenter.bintray.com/com/cloudbees/cloudbees-oss-parent/4/cloudbees-oss-parent-4.pom
Download https://jcenter.bintray.com/de/siegmar/fastcsv/1.0.2/fastcsv-1.0.2.pom
Download https://files.minecraftforge.net/maven/net/minecraftforge/srgutils/0.2.12/srgutils-0.2.12.pom
Download https://jcenter.bintray.com/org/apache/maven/maven-artifact/3.6.0/maven-artifact-3.6.0.pom
Download https://jcenter.bintray.com/com/google/guava/guava/26.0-jre/guava-26.0-jre.pom
Download https://jcenter.bintray.com/org/apache/maven/maven/3.6.0/maven-3.6.0.pom
Download https://jcenter.bintray.com/com/google/guava/guava-parent/26.0-jre/guava-parent-26.0-jre.pom
Download https://jcenter.bintray.com/org/apache/maven/maven-parent/33/maven-parent-33.pom
Download https://jcenter.bintray.com/org/apache/apache/21/apache-21.pom
Download https://plugins.gradle.org/m2/gradle/plugin/com/matthewprenger/CurseGradle/1.2.0/CurseGradle-1.2.0.pom
Download https://jcenter.bintray.com/com/google/code/findbugs/jsr305/3.0.2/jsr305-3.0.2.pom
Download https://jcenter.bintray.com/org/checkerframework/checker-qual/2.5.2/checker-qual-2.5.2.pom
Download https://jcenter.bintray.com/com/google/j2objc/j2objc-annotations/1.1/j2objc-annotations-1.1.pom
Download https://jcenter.bintray.com/org/codehaus/mojo/animal-sniffer-annotations/1.14/animal-sniffer-annotations-1.14.pom
Download https://jcenter.bintray.com/com/google/errorprone/error_prone_annotations/2.1.3/error_prone_annotations-2.1.3.pom
Download https://jcenter.bintray.com/com/google/errorprone/error_prone_parent/2.1.3/error_prone_parent-2.1.3.pom
Download https://jcenter.bintray.com/org/codehaus/mojo/animal-sniffer-parent/1.14/animal-sniffer-parent-1.14.pom
Download https://jcenter.bintray.com/org/codehaus/mojo/mojo-parent/34/mojo-parent-34.pom
Download https://jcenter.bintray.com/org/codehaus/codehaus-parent/4/codehaus-parent-4.pom
Download https://jcenter.bintray.com/org/apache/commons/commons-lang3/3.8.1/commons-lang3-3.8.1.pom
Download https://jcenter.bintray.com/org/apache/commons/commons-parent/47/commons-parent-47.pom
Download https://jcenter.bintray.com/commons-codec/commons-codec/1.6/commons-codec-1.6.pom
Download https://jcenter.bintray.com/org/apache/commons/commons-parent/22/commons-parent-22.pom
Download https://files.minecraftforge.net/maven/net/minecraftforge/gradle/ForgeGradle/3.0.181/ForgeGradle-3.0.181.jar
Download https://files.minecraftforge.net/maven/net/minecraftforge/artifactural/1.0.12/artifactural-1.0.12.jar
Download https://jcenter.bintray.com/com/cloudbees/diff4j/1.2/diff4j-1.2.jar
Download https://plugins.gradle.org/m2/gradle/plugin/com/matthewprenger/CurseGradle/1.2.0/CurseGradle-1.2.0.jar
Download https://jcenter.bintray.com/de/siegmar/fastcsv/1.0.2/fastcsv-1.0.2.jar
Download https://jcenter.bintray.com/org/apache/maven/maven-artifact/3.6.0/maven-artifact-3.6.0.jar
Download https://files.minecraftforge.net/maven/net/minecraftforge/srgutils/0.2.12/srgutils-0.2.12.jar
Download https://jcenter.bintray.com/com/google/code/findbugs/jsr305/3.0.2/jsr305-3.0.2.jar
Download https://jcenter.bintray.com/org/checkerframework/checker-qual/2.5.2/checker-qual-2.5.2.jar
Download https://jcenter.bintray.com/com/google/j2objc/j2objc-annotations/1.1/j2objc-annotations-1.1.jar
Download https://jcenter.bintray.com/com/google/errorprone/error_prone_annotations/2.1.3/error_prone_annotations-2.1.3.jar
Download https://jcenter.bintray.com/org/codehaus/mojo/animal-sniffer-annotations/1.14/animal-sniffer-annotations-1.14.jar
Download https://jcenter.bintray.com/org/apache/commons/commons-lang3/3.8.1/commons-lang3-3.8.1.jar
Download https://jcenter.bintray.com/com/google/code/gson/gson/2.8.5/gson-2.8.5.jar
Download https://jcenter.bintray.com/com/google/guava/guava/26.0-jre/guava-26.0-jre.jar

> Configure project :
New Dep: net.minecraftforge:forge:1.12.2-14.23.5.2854_mapped_stable_nodoc_39-1.12_at_d5e28e46dbb075b78b74e2fa829036afcdd85455

Download https://files.minecraftforge.net/maven/net/minecraftforge/legacydev/maven-metadata.xml
Download https://files.minecraftforge.net/maven/net/minecraftforge/legacydev/0.2.3.1/legacydev-0.2.3.1.pom
Download https://files.minecraftforge.net/maven/net/minecraftforge/mergetool/1.0.13/mergetool-1.0.13.pom
Download https://repo1.maven.org/maven2/net/sf/jopt-simple/jopt-simple/5.0.4/jopt-simple-5.0.4.pom
Download https://repo1.maven.org/maven2/org/ow2/asm/asm/6.2/asm-6.2.pom
Download https://repo1.maven.org/maven2/org/ow2/asm/asm-util/6.2/asm-util-6.2.pom
Download https://repo1.maven.org/maven2/org/ow2/asm/asm-tree/6.2/asm-tree-6.2.pom
Download https://repo1.maven.org/maven2/org/ow2/ow2/1.5/ow2-1.5.pom
Download https://repo1.maven.org/maven2/org/ow2/asm/asm-analysis/6.2/asm-analysis-6.2.pom
Download https://files.minecraftforge.net/maven/net/minecraftforge/mergetool/1.0.13/mergetool-1.0.13-forge.jar
Download https://files.minecraftforge.net/maven/org/scala-lang/plugins/scala-continuations-library_2.11/1.0.2_mc/scala-continuations-library_2.11-1.0.2_mc.jar
Download https://files.minecraftforge.net/maven/org/scala-lang/plugins/scala-continuations-plugin_2.11.1/1.0.2_mc/scala-continuations-plugin_2.11.1-1.0.2_mc.jar
Download https://files.minecraftforge.net/maven/org/scala-lang/scala-parser-combinators_2.11/1.0.1/scala-parser-combinators_2.11-1.0.1.jar
Download https://files.minecraftforge.net/maven/org/scala-lang/scala-swing_2.11/1.0.1/scala-swing_2.11-1.0.1.jar
Download https://files.minecraftforge.net/maven/org/scala-lang/scala-xml_2.11/1.0.2/scala-xml_2.11-1.0.2.jar
Download https://repo1.maven.org/maven2/net/sf/jopt-simple/jopt-simple/5.0.4/jopt-simple-5.0.4.jar
Download https://files.minecraftforge.net/maven/net/minecraftforge/legacydev/0.2.3.1/legacydev-0.2.3.1-fatjar.jar
Download https://libraries.minecraft.net/org/lwjgl/lwjgl/lwjgl-platform/2.9.4-nightly-20150209/lwjgl-platform-2.9.4-nightly-20150209.jar
Download https://libraries.minecraft.net/com/mojang/text2speech/1.10.3/text2speech-1.10.3-natives-linux.jar
Download https://repo1.maven.org/maven2/org/ow2/asm/asm-util/6.2/asm-util-6.2.jar
Download https://repo1.maven.org/maven2/org/ow2/asm/asm/6.2/asm-6.2.jar
Download https://repo1.maven.org/maven2/org/ow2/asm/asm-analysis/6.2/asm-analysis-6.2.jar
Download https://repo1.maven.org/maven2/org/ow2/asm/asm-tree/6.2/asm-tree-6.2.jar

FAILURE: Build failed with an exception.

* What went wrong:
Task 'setupCIWorkspace' not found in root project 'jei-1.12.2'.

* Try:
Run gradlew tasks to get a list of available tasks. Run with --info or --debug option to get more log output. Run with --scan to get full insights.

* Exception is:
org.gradle.execution.TaskSelectionException: Task 'setupCIWorkspace' not found in root project 'jei-1.12.2'.
	at org.gradle.execution.TaskSelector.getSelection(TaskSelector.java:116)
	at org.gradle.execution.TaskSelector.getSelection(TaskSelector.java:81)
	at org.gradle.execution.commandline.CommandLineTaskParser.parseTasks(CommandLineTaskParser.java:42)
	at org.gradle.execution.TaskNameResolvingBuildConfigurationAction.configure(TaskNameResolvingBuildConfigurationAction.java:44)
	at org.gradle.execution.DefaultBuildConfigurationActionExecuter.configure(DefaultBuildConfigurationActionExecuter.java:48)
	at org.gradle.execution.DefaultBuildConfigurationActionExecuter.access$000(DefaultBuildConfigurationActionExecuter.java:25)
	at org.gradle.execution.DefaultBuildConfigurationActionExecuter$1.proceed(DefaultBuildConfigurationActionExecuter.java:54)
	at org.gradle.execution.DefaultTasksBuildExecutionAction.configure(DefaultTasksBuildExecutionAction.java:44)
	at org.gradle.execution.DefaultBuildConfigurationActionExecuter.configure(DefaultBuildConfigurationActionExecuter.java:48)
	at org.gradle.execution.DefaultBuildConfigurationActionExecuter.access$000(DefaultBuildConfigurationActionExecuter.java:25)
	at org.gradle.execution.DefaultBuildConfigurationActionExecuter$1.proceed(DefaultBuildConfigurationActionExecuter.java:54)
	at org.gradle.execution.ExcludedTaskFilteringBuildConfigurationAction.configure(ExcludedTaskFilteringBuildConfigurationAction.java:47)
	at org.gradle.execution.DefaultBuildConfigurationActionExecuter.configure(DefaultBuildConfigurationActionExecuter.java:48)
	at org.gradle.execution.DefaultBuildConfigurationActionExecuter.select(DefaultBuildConfigurationActionExecuter.java:36)
	at org.gradle.initialization.DefaultGradleLauncher$CalculateTaskGraph.run(DefaultGradleLauncher.java:297)
	at org.gradle.internal.operations.DefaultBuildOperationExecutor$RunnableBuildOperationWorker.execute(DefaultBuildOperationExecutor.java:300)
	at org.gradle.internal.operations.DefaultBuildOperationExecutor$RunnableBuildOperationWorker.execute(DefaultBuildOperationExecutor.java:292)
	at org.gradle.internal.operations.DefaultBuildOperationExecutor.execute(DefaultBuildOperationExecutor.java:174)
	at org.gradle.internal.operations.DefaultBuildOperationExecutor.run(DefaultBuildOperationExecutor.java:90)
	at org.gradle.internal.operations.DelegatingBuildOperationExecutor.run(DelegatingBuildOperationExecutor.java:31)
	at org.gradle.initialization.DefaultGradleLauncher.constructTaskGraph(DefaultGradleLauncher.java:187)
	at org.gradle.initialization.DefaultGradleLauncher.doBuildStages(DefaultGradleLauncher.java:142)
	at org.gradle.initialization.DefaultGradleLauncher.executeTasks(DefaultGradleLauncher.java:121)
	at org.gradle.internal.invocation.GradleBuildController$1.call(GradleBuildController.java:77)
	at org.gradle.internal.invocation.GradleBuildController$1.call(GradleBuildController.java:74)
	at org.gradle.internal.work.DefaultWorkerLeaseService.withLocks(DefaultWorkerLeaseService.java:152)
	at org.gradle.internal.work.StopShieldingWorkerLeaseService.withLocks(StopShieldingWorkerLeaseService.java:38)
	at org.gradle.internal.invocation.GradleBuildController.doBuild(GradleBuildController.java:96)
	at org.gradle.internal.invocation.GradleBuildController.run(GradleBuildController.java:74)
	at org.gradle.tooling.internal.provider.ExecuteBuildActionRunner.run(ExecuteBuildActionRunner.java:28)
	at org.gradle.launcher.exec.ChainingBuildActionRunner.run(ChainingBuildActionRunner.java:35)
	at org.gradle.tooling.internal.provider.ValidatingBuildActionRunner.run(ValidatingBuildActionRunner.java:32)
	at org.gradle.launcher.exec.RunAsBuildOperationBuildActionRunner$3.run(RunAsBuildOperationBuildActionRunner.java:47)
	at org.gradle.internal.operations.DefaultBuildOperationExecutor$RunnableBuildOperationWorker.execute(DefaultBuildOperationExecutor.java:300)
	at org.gradle.internal.operations.DefaultBuildOperationExecutor$RunnableBuildOperationWorker.execute(DefaultBuildOperationExecutor.java:292)
	at org.gradle.internal.operations.DefaultBuildOperationExecutor.execute(DefaultBuildOperationExecutor.java:174)
	at org.gradle.internal.operations.DefaultBuildOperationExecutor.run(DefaultBuildOperationExecutor.java:90)
	at org.gradle.internal.operations.DelegatingBuildOperationExecutor.run(DelegatingBuildOperationExecutor.java:31)
	at org.gradle.launcher.exec.RunAsBuildOperationBuildActionRunner.run(RunAsBuildOperationBuildActionRunner.java:43)
	at org.gradle.tooling.internal.provider.SubscribableBuildActionRunner.run(SubscribableBuildActionRunner.java:51)
	at org.gradle.launcher.exec.InProcessBuildActionExecuter$1.transform(InProcessBuildActionExecuter.java:50)
	at org.gradle.launcher.exec.InProcessBuildActionExecuter$1.transform(InProcessBuildActionExecuter.java:46)
	at org.gradle.composite.internal.DefaultRootBuildState.run(DefaultRootBuildState.java:74)
	at org.gradle.launcher.exec.InProcessBuildActionExecuter.execute(InProcessBuildActionExecuter.java:46)
	at org.gradle.launcher.exec.InProcessBuildActionExecuter.execute(InProcessBuildActionExecuter.java:32)
	at org.gradle.launcher.exec.BuildTreeScopeBuildActionExecuter.execute(BuildTreeScopeBuildActionExecuter.java:39)
	at org.gradle.launcher.exec.BuildTreeScopeBuildActionExecuter.execute(BuildTreeScopeBuildActionExecuter.java:25)
	at org.gradle.tooling.internal.provider.ContinuousBuildActionExecuter.execute(ContinuousBuildActionExecuter.java:80)
	at org.gradle.tooling.internal.provider.ContinuousBuildActionExecuter.execute(ContinuousBuildActionExecuter.java:53)
	at org.gradle.tooling.internal.provider.ServicesSetupBuildActionExecuter.execute(ServicesSetupBuildActionExecuter.java:62)
	at org.gradle.tooling.internal.provider.ServicesSetupBuildActionExecuter.execute(ServicesSetupBuildActionExecuter.java:34)
	at org.gradle.tooling.internal.provider.GradleThreadBuildActionExecuter.execute(GradleThreadBuildActionExecuter.java:36)
	at org.gradle.tooling.internal.provider.GradleThreadBuildActionExecuter.execute(GradleThreadBuildActionExecuter.java:25)
	at org.gradle.tooling.internal.provider.ParallelismConfigurationBuildActionExecuter.execute(ParallelismConfigurationBuildActionExecuter.java:43)
	at org.gradle.tooling.internal.provider.ParallelismConfigurationBuildActionExecuter.execute(ParallelismConfigurationBuildActionExecuter.java:29)
	at org.gradle.tooling.internal.provider.StartParamsValidatingActionExecuter.execute(StartParamsValidatingActionExecuter.java:59)
	at org.gradle.tooling.internal.provider.StartParamsValidatingActionExecuter.execute(StartParamsValidatingActionExecuter.java:31)
	at org.gradle.tooling.internal.provider.SessionFailureReportingActionExecuter.execute(SessionFailureReportingActionExecuter.java:59)
	at org.gradle.tooling.internal.provider.SessionFailureReportingActionExecuter.execute(SessionFailureReportingActionExecuter.java:44)
	at org.gradle.tooling.internal.provider.SetupLoggingActionExecuter.execute(SetupLoggingActionExecuter.java:46)
	at org.gradle.tooling.internal.provider.SetupLoggingActionExecuter.execute(SetupLoggingActionExecuter.java:30)
	at org.gradle.launcher.cli.RunBuildAction.run(RunBuildAction.java:52)
	at org.gradle.internal.Actions$RunnableActionAdapter.execute(Actions.java:207)
	at org.gradle.launcher.cli.CommandLineActionFactory$ParseAndBuildAction.execute(CommandLineActionFactory.java:402)
	at org.gradle.launcher.cli.CommandLineActionFactory$ParseAndBuildAction.execute(CommandLineActionFactory.java:375)
	at org.gradle.launcher.cli.ExceptionReportingAction.execute(ExceptionReportingAction.java:37)
	at org.gradle.launcher.cli.ExceptionReportingAction.execute(ExceptionReportingAction.java:23)
	at org.gradle.launcher.cli.CommandLineActionFactory$WithLogging.execute(CommandLineActionFactory.java:368)
	at org.gradle.launcher.cli.CommandLineActionFactory$WithLogging.execute(CommandLineActionFactory.java:298)
	at org.gradle.launcher.Main.doAction(Main.java:36)
	at org.gradle.launcher.bootstrap.EntryPoint.run(EntryPoint.java:45)
	at org.gradle.launcher.bootstrap.ProcessBootstrap.runNoExit(ProcessBootstrap.java:60)
	at org.gradle.launcher.bootstrap.ProcessBootstrap.run(ProcessBootstrap.java:37)
	at org.gradle.launcher.GradleMain.main(GradleMain.java:23)
	at org.gradle.wrapper.BootstrapMainStarter.start(BootstrapMainStarter.java:31)
	at org.gradle.wrapper.WrapperExecutor.execute(WrapperExecutor.java:108)
	at org.gradle.wrapper.GradleWrapperMain.main(GradleWrapperMain.java:61)


* Get more help at https://help.gradle.org

Deprecated Gradle features were used in this build, making it incompatible with Gradle 5.0.
Use '--warning-mode all' to show the individual deprecation warnings.
See https://docs.gradle.org/4.9/userguide/command_line_interface.html#sec:command_line_warnings

BUILD FAILED in 35s
Build step 'Invoke Gradle script' changed build result to FAILURE
Build step 'Invoke Gradle script' marked build as failure
Archiving artifacts
Recording fingerprints
Collecting metadata...
Metadata collection done.
Started calculate disk usage of build
Finished Calculation of disk usage of build in 0 seconds
Started calculate disk usage of workspace
Finished Calculation of disk usage of workspace in 0 seconds
Finished: FAILURE